VPS侦探论坛

 找回密码
 注册
搜索
热搜: pathinfo
查看: 623|回复: 1

树莓派3B 安装lnmp1.5失败

[复制链接]
发表于 2018-8-10 10:16:23 | 显示全部楼层 |阅读模式

1.3和1.4版本安装正常
1.5版本安装过程出现系统卡死,是散热问题,以前版本是单核编译,1.5版本是四核编译,温度爆涨。

使用完整包安装,增加2G的交换空间,MySQL始终是安装不上,5.7和8.0都试过。

You will install lnmpa stack.
nginx-1.14.0
mysql-8.0.11
php-7.2.6
httpd-2.4.33
Enable InnoDB: y

============================== Check install ==============================
Checking ...
Nginx: OK
Error: MySQL install failed.
PHP: OK
Apache: OK
Sorry, Failed to install LNMP!
Please visit https://bbs.vpser.net/forum-25-1.html feedback errors and logs.
You can download /root/lnmp-install.log from your server,and upload lnmp-install.log to LNMP Forum.

附件大小限制,删除一小部分没用的日志。

本帖子中包含更多资源

您需要 登录 才可以下载或查看,没有帐号?注册

x
美国VPS推荐: 遨游主机LinodeLOCVPSKVMLAVPS2EZ搬瓦工80VPSVultr美国VPS主机中国VPS推荐: 阿里云腾讯云。LNMP付费服务(代装/问题排查)QQ 503228080
发表于 2018-8-10 18:14:56 | 显示全部楼层

[ 77%] Linking CXX executable ../../../runtime_output_directory/pfs_connect_attr-t
collect2: fatal error: ld terminated with signal 6 [已放弃]
compilation terminated.
terminate called after throwing an instance of 'std::bad_alloc'
  what():  std::bad_alloc
storage/perfschema/unittest/CMakeFiles/pfs_connect_attr-t.dir/build.make:213: recipe for target 'runtime_output_directory/pfs_connect_attr-t' failed
make[2]: *** [runtime_output_directory/pfs_connect_attr-t] Error 1
make[2]: *** Deleting file 'runtime_output_directory/pfs_connect_attr-t'
CMakeFiles/Makefile2:3134: recipe for target 'storage/perfschema/unittest/CMakeFiles/pfs_connect_attr-t.dir/all' failed
make[1]: *** [storage/perfschema/unittest/CMakeFiles/pfs_connect_attr-t.dir/all] Error 2
Makefile:160: recipe for target 'all' failed
make: *** [all] Error 2
[ 77%] Linking CXX executable ../../../runtime_output_directory/pfs_connect_attr-t
/usr/bin/ld.gold:致命错误:../../../runtime_output_directory/pfs_connect_attr-t: mmap: failed to allocate 597498056 bytes for output file: 无法分配内存
collect2: error: ld returned 1 exit status
storage/perfschema/unittest/CMakeFiles/pfs_connect_attr-t.dir/build.make:213: recipe for target 'runtime_output_directory/pfs_connect_attr-t' failed
make[2]: *** [runtime_output_directory/pfs_connect_attr-t] Error 1
CMakeFiles/Makefile2:3134: recipe for target 'storage/perfschema/unittest/CMakeFiles/pfs_connect_attr-t.dir/all' failed
make[1]: *** [storage/perfschema/unittest/CMakeFiles/pfs_connect_attr-t.dir/all] Error 2
Makefile:160: recipe for target 'all' failed

boost安装过程报错,也有内存不足的报错
这个没办法,x86上安装mysql 8.0都吃力更不用说arm平台了
美国VPS推荐: 遨游主机LinodeLOCVPSKVMLAVPS2EZ搬瓦工80VPSVultr美国VPS主机中国VPS推荐: 阿里云腾讯云。LNMP付费服务(代装/问题排查)QQ 503228080
您需要登录后才可以回帖 登录 | 注册

本版积分规则

小黑屋|手机版|Archiver|VPS侦探 ( 鲁ICP备16040043号-1 )

GMT+8, 2019-5-25 12:24 , Processed in 0.046532 second(s), 27 queries .

Powered by Discuz! X3.4

© 2001-2017 Comsenz Inc.

快速回复 返回顶部 返回列表