Board logo

标题: 树莓派3B 安装lnmp1.5失败 [打印本页]

作者: figo3dg6    时间: 2018-8-10 10:16     标题: 树莓派3B 安装lnmp1.5失败

1.3和1.4版本安装正常
1.5版本安装过程出现系统卡死,是散热问题,以前版本是单核编译,1.5版本是四核编译,温度爆涨。

使用完整包安装,增加2G的交换空间,MySQL始终是安装不上,5.7和8.0都试过。

You will install lnmpa stack.
nginx-1.14.0
mysql-8.0.11
php-7.2.6
httpd-2.4.33
Enable InnoDB: y

============================== Check install ==============================
Checking ...
Nginx: OK
Error: MySQL install failed.
PHP: OK
Apache: OK
Sorry, Failed to install LNMP!
Please visit https://bbs.vpser.net/forum-25-1.html feedback errors and logs.
You can download /root/lnmp-install.log from your server,and upload lnmp-install.log to LNMP Forum.

附件大小限制,删除一小部分没用的日志。
作者: licess    时间: 2018-8-10 18:14

[ 77%] Linking CXX executable ../../../runtime_output_directory/pfs_connect_attr-t
collect2: fatal error: ld terminated with signal 6 [已放弃]
compilation terminated.
terminate called after throwing an instance of 'std::bad_alloc'
  what():  std::bad_alloc
storage/perfschema/unittest/CMakeFiles/pfs_connect_attr-t.dir/build.make:213: recipe for target 'runtime_output_directory/pfs_connect_attr-t' failed
make[2]: *** [runtime_output_directory/pfs_connect_attr-t] Error 1
make[2]: *** Deleting file 'runtime_output_directory/pfs_connect_attr-t'
CMakeFiles/Makefile2:3134: recipe for target 'storage/perfschema/unittest/CMakeFiles/pfs_connect_attr-t.dir/all' failed
make[1]: *** [storage/perfschema/unittest/CMakeFiles/pfs_connect_attr-t.dir/all] Error 2
Makefile:160: recipe for target 'all' failed
make: *** [all] Error 2
[ 77%] Linking CXX executable ../../../runtime_output_directory/pfs_connect_attr-t
/usr/bin/ld.gold:致命错误:../../../runtime_output_directory/pfs_connect_attr-t: mmap: failed to allocate 597498056 bytes for output file: 无法分配内存
collect2: error: ld returned 1 exit status
storage/perfschema/unittest/CMakeFiles/pfs_connect_attr-t.dir/build.make:213: recipe for target 'runtime_output_directory/pfs_connect_attr-t' failed
make[2]: *** [runtime_output_directory/pfs_connect_attr-t] Error 1
CMakeFiles/Makefile2:3134: recipe for target 'storage/perfschema/unittest/CMakeFiles/pfs_connect_attr-t.dir/all' failed
make[1]: *** [storage/perfschema/unittest/CMakeFiles/pfs_connect_attr-t.dir/all] Error 2
Makefile:160: recipe for target 'all' failed

boost安装过程报错,也有内存不足的报错
这个没办法,x86上安装mysql 8.0都吃力更不用说arm平台了




欢迎光临 VPS侦探论坛 (http://bbs.vpser.net/) Powered by Discuz! 6.0.0