打印

树莓派3B 安装lnmp1.5失败

[ 77%] Linking CXX executable ../../../runtime_output_directory/pfs_connect_attr-t
collect2: fatal error: ld terminated with signal 6 [已放弃]
compilation terminated.
terminate called after throwing an instance of 'std::bad_alloc'
  what():  std::bad_alloc
storage/perfschema/unittest/CMakeFiles/pfs_connect_attr-t.dir/build.make:213: recipe for target 'runtime_output_directory/pfs_connect_attr-t' failed
make[2]: *** [runtime_output_directory/pfs_connect_attr-t] Error 1
make[2]: *** Deleting file 'runtime_output_directory/pfs_connect_attr-t'
CMakeFiles/Makefile2:3134: recipe for target 'storage/perfschema/unittest/CMakeFiles/pfs_connect_attr-t.dir/all' failed
make[1]: *** [storage/perfschema/unittest/CMakeFiles/pfs_connect_attr-t.dir/all] Error 2
Makefile:160: recipe for target 'all' failed
make: *** [all] Error 2
[ 77%] Linking CXX executable ../../../runtime_output_directory/pfs_connect_attr-t
/usr/bin/ld.gold:致命错误:../../../runtime_output_directory/pfs_connect_attr-t: mmap: failed to allocate 597498056 bytes for output file: 无法分配内存
collect2: error: ld returned 1 exit status
storage/perfschema/unittest/CMakeFiles/pfs_connect_attr-t.dir/build.make:213: recipe for target 'runtime_output_directory/pfs_connect_attr-t' failed
make[2]: *** [runtime_output_directory/pfs_connect_attr-t] Error 1
CMakeFiles/Makefile2:3134: recipe for target 'storage/perfschema/unittest/CMakeFiles/pfs_connect_attr-t.dir/all' failed
make[1]: *** [storage/perfschema/unittest/CMakeFiles/pfs_connect_attr-t.dir/all] Error 2
Makefile:160: recipe for target 'all' failed

boost安装过程报错,也有内存不足的报错
这个没办法,x86上安装mysql 8.0都吃力更不用说arm平台了

LNMP付费问题排查/LNMP技术支持/Paypal信用卡代付/代购VPS,域名,软件等 QQ 503228080 旺旺 lzhenbao
军哥淘宝店铺
QQ/旺旺仅提供代购及付费代维/问题解决等服务,其他不回复!LNMP相关问题请在本论坛发帖,提问前先搜索,按https://bbs.vpser.net/thread-2555-1-1.html 要求反馈问题!

TOP